what do you want to do with this cloop?
use kernel module od jsut extract_compressed_fs binaries?
I am using fedora core 2 and I have tried to compile cloop version 2.01-5. However the default tarball gives me the following errors:
[root@skibum cloop-2.01]# make
( make -C advancecomp-1.9_create_compressed_fs advfs )
make[1]: Entering directory `/home/savarese/cloop-2.01/advancecomp-1.9_create_co
mpressed_fs'
g++ -DHAVE_CONFIG_H -I. -I. -I. -g -O3 -DUSE_ERROR_SILENT -DUSE_COMPRESS -c
-o advfs.o `test -f 'advfs.cc' || echo './'`advfs.cc
In file included from advfs.cc:24:
/usr/include/asm/byteorder.h:6:2: warning: #warning using private kernel header;
include <endian.h> instead!
In file included from advfs.cc:33:
/usr/include/netinet/in.h:262: error: syntax error before `)' token
/usr/include/netinet/in.h:262: error: syntax error before `?' token
/usr/include/netinet/in.h:262: error: syntax error before `)' token
/usr/include/netinet/in.h:263: error: syntax error before `)' token
/usr/include/netinet/in.h:263: error: syntax error before `?' token
/usr/include/netinet/in.h:263: error: syntax error before `)' token
/usr/include/netinet/in.h:265: error: syntax error before `)' token
/usr/include/netinet/in.h:265: error: syntax error before `?' token
/usr/include/netinet/in.h:265: error: syntax error before `)' token
/usr/include/netinet/in.h:267: error: syntax error before `)' token
/usr/include/netinet/in.h:267: error: syntax error before `?' token
/usr/include/netinet/in.h:267: error: syntax error before `)' token
In file included from advfs.cc:33:
/usr/include/netinet/in.h:387: error: syntax error before `}' token
make[1]: *** [advfs.o] Error 1
make[1]: Leaving directory `/home/savarese/cloop-2.01/advancecomp-1.9_create_com
pressed_fs'
make: *** [advancecomp-1.9_create_compressed_fs/advfs] Error 2
When I remove the byteorder include from advfs.cc and replace it with endian.h, I get this error:
[root@skibum cloop-2.01]# make
( make -C advancecomp-1.9_create_compressed_fs advfs )
make[1]: Entering directory `/home/savarese/cloop-2.01/advancecomp-1.9_create_compressed_fs'
g++ -DHAVE_CONFIG_H -I. -I. -I. -g -O3 -DUSE_ERROR_SILENT -DUSE_COMPRESS -c -o advfs.o `test -f 'advfs.cc' || echo './'`advfs.cc
advfs.cc: In function `int main(int, char**)':
advfs.cc:245: error: `__cpu_to_be64' undeclared (first use this function)
advfs.cc:245: error: (Each undeclared identifier is reported only once for each
function it appears in.)
make[1]: *** [advfs.o] Error 1
make[1]: Leaving directory `/home/savarese/cloop-2.01/advancecomp-1.9_create_compressed_fs'
make: *** [advancecomp-1.9_create_compressed_fs/advfs] Error 2
My kernel version is 2.6.8-1.521smp. Does anybody knows why this happens?
Thanks,
Scott
what do you want to do with this cloop?
use kernel module od jsut extract_compressed_fs binaries?
I had the same problem..
If you move the line
#include <netinet/in.h>
above the original
#include <asm/byteorder.h>
the code should compile..It did the trick here... and I'm running FC2 with 2.4.22 kernel..
Originally Posted by scottsavarese
![]()
![]()
![]()
![]()

(New) AMD Ryzen 7 5700X 8 Core 16 Thread AM4 Unlocked 3.4 GHz CPU OEM Tray
$174.99
HP ZBook Firefly 14" G8 Mobile Workstation i5 11th Gen 16GB RAM 256 GB SSD No AC
$184.99
Lenovo ThinkPad T14S Gen 1 8-Core Ryzen 7 Pro 4750U 512GB SSD 16GB RAM FAIR BATT
$225.00
SGIN 17.3" Laptop Intel Quad-Core Up to 2.4 GHZ 8GB RAM 256GB SSD HD
$229.99
Intel Xeon E5 - 2667V2 / SR19W 3.30GHz 25MB 8-Core CPU Socket LGA2011
$30.00
AMD Ryzen 7 9800X3D 8-Core 16-Thread AM5 CPU Processor Brand New Unused
$395.95
AMD FX 8350 8-CORE 4.00GHz CPU FD8350FRW8KHK SOCKET AM3+ *QTY
$39.99
AMD Ryzen 7 9700X 8-Core 16-Thread 40MB Cache Socket AM5 9000 Series Processor
$245.99
Dell T7810 Workstation 8-Core 2.40GHz E5-2630 v3 No RAM GPU HDD OS
$259.98
Home Assistant Server | 8GB RAM | 128GB SSD | Intel i5 Quad-Core | Dell OptiPlex
$159.99