what do you want to do with this cloop?
use kernel module od jsut extract_compressed_fs binaries?
I am using fedora core 2 and I have tried to compile cloop version 2.01-5. However the default tarball gives me the following errors:
[root@skibum cloop-2.01]# make
( make -C advancecomp-1.9_create_compressed_fs advfs )
make[1]: Entering directory `/home/savarese/cloop-2.01/advancecomp-1.9_create_co
mpressed_fs'
g++ -DHAVE_CONFIG_H -I. -I. -I. -g -O3 -DUSE_ERROR_SILENT -DUSE_COMPRESS -c
-o advfs.o `test -f 'advfs.cc' || echo './'`advfs.cc
In file included from advfs.cc:24:
/usr/include/asm/byteorder.h:6:2: warning: #warning using private kernel header;
include <endian.h> instead!
In file included from advfs.cc:33:
/usr/include/netinet/in.h:262: error: syntax error before `)' token
/usr/include/netinet/in.h:262: error: syntax error before `?' token
/usr/include/netinet/in.h:262: error: syntax error before `)' token
/usr/include/netinet/in.h:263: error: syntax error before `)' token
/usr/include/netinet/in.h:263: error: syntax error before `?' token
/usr/include/netinet/in.h:263: error: syntax error before `)' token
/usr/include/netinet/in.h:265: error: syntax error before `)' token
/usr/include/netinet/in.h:265: error: syntax error before `?' token
/usr/include/netinet/in.h:265: error: syntax error before `)' token
/usr/include/netinet/in.h:267: error: syntax error before `)' token
/usr/include/netinet/in.h:267: error: syntax error before `?' token
/usr/include/netinet/in.h:267: error: syntax error before `)' token
In file included from advfs.cc:33:
/usr/include/netinet/in.h:387: error: syntax error before `}' token
make[1]: *** [advfs.o] Error 1
make[1]: Leaving directory `/home/savarese/cloop-2.01/advancecomp-1.9_create_com
pressed_fs'
make: *** [advancecomp-1.9_create_compressed_fs/advfs] Error 2
When I remove the byteorder include from advfs.cc and replace it with endian.h, I get this error:
[root@skibum cloop-2.01]# make
( make -C advancecomp-1.9_create_compressed_fs advfs )
make[1]: Entering directory `/home/savarese/cloop-2.01/advancecomp-1.9_create_compressed_fs'
g++ -DHAVE_CONFIG_H -I. -I. -I. -g -O3 -DUSE_ERROR_SILENT -DUSE_COMPRESS -c -o advfs.o `test -f 'advfs.cc' || echo './'`advfs.cc
advfs.cc: In function `int main(int, char**)':
advfs.cc:245: error: `__cpu_to_be64' undeclared (first use this function)
advfs.cc:245: error: (Each undeclared identifier is reported only once for each
function it appears in.)
make[1]: *** [advfs.o] Error 1
make[1]: Leaving directory `/home/savarese/cloop-2.01/advancecomp-1.9_create_compressed_fs'
make: *** [advancecomp-1.9_create_compressed_fs/advfs] Error 2
My kernel version is 2.6.8-1.521smp. Does anybody knows why this happens?
Thanks,
Scott
what do you want to do with this cloop?
use kernel module od jsut extract_compressed_fs binaries?
I had the same problem..
If you move the line
#include <netinet/in.h>
above the original
#include <asm/byteorder.h>
the code should compile..It did the trick here... and I'm running FC2 with 2.4.22 kernel..
Originally Posted by scottsavarese
![]()
![]()
![]()
![]()

Dell 6P85J 4TB ST4000NM0063 7.2k 6Gb/s 3.5” SAS SED Hard Drive with Tray
$39.99
Western Digital HUS726T4TAL5204 4TB 7.2K SAS 12Gb/s 3.5" 512e HDD NetApp X375A
$64.00
20TB 7200 RPM SATA III Internal 3.5" White Label Hard drive
$349.99
HGST Ultrastar HUS726040AL5210 4TB 7200RPM SAS 12Gb/s Enterprise HDD
$41.00
Western Digital WD Red 4TB NAS Hard Drive WD40EFRX SATA 64MB 3.5" HDD
$70.00
Western Digital WD Blue WD10EZEX 1 TB 3.5" SATA III Desktop Hard Drive
$23.99
Dell ST6000NM0034 1HT27Z-150 NWCCG 6TB SAS 3.5 7.2K ENTERPRISE SERVER DRIVE
$68.99
Lot of 2 HP 4TB / 128MB SATA 7.2K RPM 3.5" Hard Drive MB4000GCWDC /ST4000NM0033
$125.00
Toshiba DT01ACA100 1 TB 3.5" SATA III 3.5 in Desktop Hard Drive
$24.99
DELL 2TB Enterprise HDD (7200RPM, 3.5", SATA III, 128MB Cache) HUS722T2TALA600
$49.95