what do you want to do with this cloop?
use kernel module od jsut extract_compressed_fs binaries?
I am using fedora core 2 and I have tried to compile cloop version 2.01-5. However the default tarball gives me the following errors:
[root@skibum cloop-2.01]# make
( make -C advancecomp-1.9_create_compressed_fs advfs )
make[1]: Entering directory `/home/savarese/cloop-2.01/advancecomp-1.9_create_co
mpressed_fs'
g++ -DHAVE_CONFIG_H -I. -I. -I. -g -O3 -DUSE_ERROR_SILENT -DUSE_COMPRESS -c
-o advfs.o `test -f 'advfs.cc' || echo './'`advfs.cc
In file included from advfs.cc:24:
/usr/include/asm/byteorder.h:6:2: warning: #warning using private kernel header;
include <endian.h> instead!
In file included from advfs.cc:33:
/usr/include/netinet/in.h:262: error: syntax error before `)' token
/usr/include/netinet/in.h:262: error: syntax error before `?' token
/usr/include/netinet/in.h:262: error: syntax error before `)' token
/usr/include/netinet/in.h:263: error: syntax error before `)' token
/usr/include/netinet/in.h:263: error: syntax error before `?' token
/usr/include/netinet/in.h:263: error: syntax error before `)' token
/usr/include/netinet/in.h:265: error: syntax error before `)' token
/usr/include/netinet/in.h:265: error: syntax error before `?' token
/usr/include/netinet/in.h:265: error: syntax error before `)' token
/usr/include/netinet/in.h:267: error: syntax error before `)' token
/usr/include/netinet/in.h:267: error: syntax error before `?' token
/usr/include/netinet/in.h:267: error: syntax error before `)' token
In file included from advfs.cc:33:
/usr/include/netinet/in.h:387: error: syntax error before `}' token
make[1]: *** [advfs.o] Error 1
make[1]: Leaving directory `/home/savarese/cloop-2.01/advancecomp-1.9_create_com
pressed_fs'
make: *** [advancecomp-1.9_create_compressed_fs/advfs] Error 2
When I remove the byteorder include from advfs.cc and replace it with endian.h, I get this error:
[root@skibum cloop-2.01]# make
( make -C advancecomp-1.9_create_compressed_fs advfs )
make[1]: Entering directory `/home/savarese/cloop-2.01/advancecomp-1.9_create_compressed_fs'
g++ -DHAVE_CONFIG_H -I. -I. -I. -g -O3 -DUSE_ERROR_SILENT -DUSE_COMPRESS -c -o advfs.o `test -f 'advfs.cc' || echo './'`advfs.cc
advfs.cc: In function `int main(int, char**)':
advfs.cc:245: error: `__cpu_to_be64' undeclared (first use this function)
advfs.cc:245: error: (Each undeclared identifier is reported only once for each
function it appears in.)
make[1]: *** [advfs.o] Error 1
make[1]: Leaving directory `/home/savarese/cloop-2.01/advancecomp-1.9_create_compressed_fs'
make: *** [advancecomp-1.9_create_compressed_fs/advfs] Error 2
My kernel version is 2.6.8-1.521smp. Does anybody knows why this happens?
Thanks,
Scott
what do you want to do with this cloop?
use kernel module od jsut extract_compressed_fs binaries?
I had the same problem..
If you move the line
#include <netinet/in.h>
above the original
#include <asm/byteorder.h>
the code should compile..It did the trick here... and I'm running FC2 with 2.4.22 kernel..
Originally Posted by scottsavarese
![]()
![]()
![]()
![]()

IBM System X3850-X5 Server w/4x Intel Xeon E7-4870 CPU , 512 GB DDR3 RAM,NO HDD
$1299.99
IBM QRadar xx29 2x Xeon E5-2650v4 2x 900W PSU M5120 12x 3.5" Bay Server No RAM
$179.99
Unused IBM 09P0037 MAINBOARD For RS/6000 7044-170 P-Series
$375.00
IBM ADP Server Type 7870 AC1 NO HDD | 128GB RAM PC3L | 2 x Xeon E5620
$199.99
IBM Power 8 S822L Server 8247-22L POWER8 Enterprise 256GB RAM 2x 00KV626 CPU
$999.99
Compaq ProLiant 1500R 5/100 rack server, Series 3155, with IBM 2.1GB HD, VINTAGE
$295.00
IBM System x3550 M3 1U Server 2x Xeon E5645, 192GB RAM, 2x 300GB HDD (7944-AC1)
$150.00
IBM SYSTEM X3500 M3 SERVER 7380AC1 TOWER Server XEON E5620 8GB RAID SEE NOTES
$110.30
IBM System X3650 M3 Server Xeon E5620 2.4 GHz 16 GB Ram Raid M5015 No OS No HDD
$87.96
IBM 00FN709 X3850 X6 Compute Book 3837 Barebone
$114.99