-
Re: Error on unionfs

Originally Posted by
Linuxgamer
Hi
I get an error on unionfs make:
root@kein Ausgabegerät[unionfs-1.3]# make
************************************************** ****************************
If you have questions about or problems building Unionfs, please read INSTALL.
************************************************** ****************************
make -C /usr/src/linux-2.6.17.8 SUBDIRS=/usr/src/modules/unionfs-1.3 FISTDEVMK=/usr/src/modules/unionfs-1.3/fistdev.mk modules
make[1]: Entering directory `/usr/src/linux-2.6.17.8'
Building modules, stage 2.
MODPOST
make[1]: Leaving directory `/usr/src/linux-2.6.17.8'
make -C utils all CC=gcc UCFLAGS='-I.. -I. -O2 -Wall -Werror -DUNIONFS_VERSION=\"1.3\" -DSUP_MAJOR=2 -DSUP_MINOR=6 -DSUP_PATCH=17'
make[1]: Entering directory `/usr/src/modules/unionfs-1.3/utils'
gcc -o unionimap unionimap.c usercommon.c -luuid -I.. -I. -O2 -Wall -Werror -DUNIONFS_VERSION=\"1.3\" -DSUP_MAJOR=2 -DSUP_MINOR=6 -DSUP_PATCH=17
In file included from unionimap.c:22:
unionimap.h:29:23: error: uuid/uuid.h: Datei oder Verzeichnis nicht gefunden
unionimap.c: In function 'create_forwardmap':
unionimap.c:57: error: 'uuid_t' undeclared (first use in this function)
unionimap.c:57: error: (Each undeclared identifier is reported only once
unionimap.c:57: error: for each function it appears in.)
unionimap.c:57: error: syntax error before 'uuid'
cc1: warnings being treated as errors
unionimap.c:68: warning: implicit declaration of function 'uuid_generate'
unionimap.c:68: error: 'uuid' undeclared (first use in this function)
unionimap.c: In function 'create_reversemap':
unionimap.c:182: error: 'uuid_t' undeclared (first use in this function)
unionimap.c:182: error: syntax error before 'uuid'
unionimap.c:212: error: 'uuid' undeclared (first use in this function)
unionimap.c: In function 'print_forwardmap':
unionimap.c:305: warning: implicit declaration of function 'uuid_unparse'
make[1]: *** [unionimap] Fehler 1
make[1]: Leaving directory `/usr/src/modules/unionfs-1.3/utils'
make: *** [utils] Fehler 2
root@kein Ausgabegerät[unionfs-1.3]#
Im using Knoppix5.01 Kernel 2.6.17.8
With other unionfs versions there are other errors, too
Thx for HELP
Linuxgamer
You don't need to do the full make to upgrade the Knoppix kernel, you only require the unionfs.ko file. This can be compiled using:
Similar Threads
-
By sublime005la in forum Other Live CDs
Replies: 1
Last Post: 09-13-2006, 01:43 PM
-
By waellinux in forum Hdd Install / Debian / Apt
Replies: 1
Last Post: 06-27-2005, 06:34 AM
-
By Henk Poley in forum Tips and Tricks
Replies: 10
Last Post: 01-29-2004, 08:04 AM
-
By soapee01 in forum Hdd Install / Debian / Apt
Replies: 4
Last Post: 05-15-2003, 10:08 PM
-
By eadz in forum Customising & Remastering
Replies: 1
Last Post: 01-17-2003, 01:37 AM
Posting Permissions
- You may not post new threads
- You may not post replies
- You may not post attachments
- You may not edit your posts
-
Forum Rules

Intel Core i7-6700 SR2L2 3.40GHz 8 MB 4-Core LGA1151 Socket CPU Processor
$27.99

Intel Core i7-12700K 12th Gen Desktop Processor – LGA 1700 – Unlocked
$280.00

INTEL CORE I9-10940X X-SERIES PROCESSOR | 3.30GHZ | SRGSH
$179.99

AMD Ryzen 7 2700X 8-Core 3.7GHz Socket AM4 CPU Processor YD270XBGAFBOX
$95.00

Intel Core i7-3770K 3.5 GHz Processor
$39.00

Intel Core i5-12500T SRL5W 2GHz 18MB 6 Core Socket LGA1700 Desktop CPU Processor
$114.99

Intel Xeon E3-1230 v3 SR153 3.3GHz Quad Core LGA 1150 CPU Processor
$14.49

Intel Core i7-7700K SR33A 4.20GHz 4-Core LGA1151 CPU Processor
$62.95

Intel Core i5-4590T 2 GHz 5 GT/s LGA 1150 Desktop CPU Processor SR1S6
$10.99

Lenovo ThinkCentre M920s SFF Barebones PC Motherboard PSU DVD No CPU RAM SSD
$27.99