-
Trouble installing gambas,apache 1.x.x, postgress 8.03
I Hope this is the right room
This is the first time i remastering, i remastering GAMES KNOPPIX 3.7.0.2.\ with menu based script .
When i try to install gambas from source code ,i found error like this ?
checking how to run the C preprocessor... /lib/cpp
configure: error: C preprocessor "/lib/cpp" fails sanity check
See `config.log' for more details.
When i try to install apace 1.3.x.x, i found error like this ?
root@ttyp2[apache_1.3.31]#./configure --enable-module=so
root@ttyp2[apache_1.3.31]# make
===> src
make[1]: Entering directory `/usr/src/apache_1.3.31'
make[2]: Entering directory `/usr/src/apache_1.3.31/src'
===> src/regex
gcc -I. -I../os/unix -I../include -DLINUX=22 -DUSE_HSREGEX `../apaci` -DPOSIX_MISTAKE -c -o regcomp.o regcomp.c
In file included from /usr/include/bits/posix1_lim.h:130,
from /usr/include/limits.h:144,
from /usr/lib/gcc-lib/i486-linux/3.3.5/include/limits.h:122,
from /usr/lib/gcc-lib/i486-linux/3.3.5/include/syslimits.h:7,
from /usr/lib/gcc-lib/i486-linux/3.3.5/include/limits.h:11,
from regcomp.c:5:
/usr/include/bits/local_lim.h:36:26: linux/limits.h: No such file or directory
make[3]: *** [regcomp.o] Error 1
make[2]: *** [subdirs] Error 1
make[2]: Leaving directory `/usr/src/apache_1.3.31/src'
make[1]: *** [build-std] Error 2
make[1]: Leaving directory `/usr/src/apache_1.3.31'
make: *** [build] Error 2
the last one, i try to install postgress 8, the error like this ?
In file included from /usr/include/bits/posix1_lim.h:130,
from /usr/include/limits.h:144,
from /usr/lib/gcc-lib/i486-linux/3.3.5/include/limits.h:122,
from /usr/lib/gcc-lib/i486-linux/3.3.5/include/syslimits.h:7,
from /usr/lib/gcc-lib/i486-linux/3.3.5/include/limits.h:11,
from /usr/include/bits/socket.h:31,
from /usr/include/sys/socket.h:35,
from /usr/include/netinet/in.h:24,
from /usr/include/netdb.h:28,
from ../../src/include/port.h:17,
from ../../src/include/c.h:784,
from getaddrinfo.c:21:
/usr/include/bits/local_lim.h:36:26: linux/limits.h: No such file or directory
In file included from /usr/include/sys/socket.h:35,
from /usr/include/netinet/in.h:24,
from /usr/include/netdb.h:28,
from ../../src/include/port.h:17,
from ../../src/include/c.h:784,
from getaddrinfo.c:21:
/usr/include/bits/socket.h:305:24: asm/socket.h: No such file or directory
In file included from getaddrinfo.c:31:
../../src/include/getaddrinfo.h:79: error: redefinition of `struct addrinfo'
make[2]: *** [getaddrinfo.o] Error 1
make[2]: Leaving directory `/usr/src/postgresql-8.0.3/src/port'
make[1]: *** [all] Error 2
make[1]: Leaving directory `/usr/src/postgresql-8.0.3/src'
make: *** [all] Error 2
anyone please help me ????
Similar Threads
-
By fenzda in forum General Support
Replies: 0
Last Post: 07-11-2007, 05:19 AM
-
By mike23 in forum Hdd Install / Debian / Apt
Replies: 2
Last Post: 05-26-2005, 11:41 AM
-
By geopfm in forum General Support
Replies: 3
Last Post: 02-14-2005, 10:35 PM
-
By ikkenorsk in forum General Support
Replies: 2
Last Post: 07-08-2004, 11:02 PM
-
By kaplanfx in forum Hdd Install / Debian / Apt
Replies: 0
Last Post: 08-15-2003, 04:53 AM
Posting Permissions
- You may not post new threads
- You may not post replies
- You may not post attachments
- You may not edit your posts
-
Forum Rules

Lenovo ThinkPad L13 Yoga Touch Laptop 13.3” Core i5 8GB RAM 256GB SSD Win 11 Pro
$239.99

Lenovo ThinkPad L15 Gen 3 15.6" 16GB, Thunder Black
$241.50

Lenovo ThinkPad E14 Gen 2 Laptop 14” HD Ryzen 5 16GB RAM 512GB SSD Win 11 Pro
$319.99

Lenovo ThinkPad T14 Gen 2 i5-1145G7 16GB 512GB SSD Touch Win 11 Pro Good
$261.99

Lenovo ThinkPad E14 Gen 3 Laptop 14” FHD AMD Ryzen 5 16GB RAM 512GB SSD Win 11
$374.99

Lenovo ThinkPad L14 Gen 3 14" FHD Laptop i5 12th Gen 16GB RAM 256GB SSD Win 11
$329.99

Lenovo Thinkpad T14 Gen 2i 14" 16GB 512GB, Black
$313.00

Lenovo ThinkPad L14 Gen 2 14" Laptop Core i5-1135G7 2.40GHz 8GB RAM 256GB SSD
$124.99

Lenovo ThinkPad L15 Gen 3 15.6" 16GB, Thunder Black
$241.50

Lenovo ThinkPad T495 14” Laptop AMD Ryzen 5 PRO 16GB RAM 256GB SSD Windows 11
$229.99