via rhine should be supported out of box in 99%of cases, no need to recompile
i recently bought this VIA Technologies, Inc. VT6105 [Rhine-III ethernet card, the diskette inside had an old version of the driver wich doesnt support 2.6 version of kernel,so i downloaded the new driver trought VIA website
Compiled it and got some errors.
here's some info
knoppix 4.0.2 from cd.
here's some info:
compiling the ethernet card driver:Code:lspci 0000:00:00.0 Host bridge: Silicon Integrated Systems [SiS] 650/M650 Host (rev 01) 0000:00:01.0 PCI bridge: Silicon Integrated Systems [SiS] Virtual PCI-to-PCI bridge (AGP) 0000:00:02.0 ISA bridge: Silicon Integrated Systems [SiS] SiS961 [MuTIOL Media IO] 0000:00:02.1 SMBus: Silicon Integrated Systems [SiS]: Unknown device 0016 0000:00:02.2 USB Controller: Silicon Integrated Systems [SiS] USB 1.0 Controller (rev 07) 0000:00:02.3 USB Controller: Silicon Integrated Systems [SiS] USB 1.0 Controller (rev 07) 0000:00:02.5 IDE interface: Silicon Integrated Systems [SiS] 5513 [IDE] (rev d0) 0000:00:02.6 Modem: Silicon Integrated Systems [SiS] AC'97 Modem Controller (rev a0) 0000:00:02.7 Multimedia audio controller: Silicon Integrated Systems [SiS] Sound Controller (rev a0) 0000:00:03.0 Ethernet controller: Silicon Integrated Systems [SiS] SiS900 PCI Fast Ethernet (rev 90) 0000:00:09.0 Ethernet controller: VIA Technologies, Inc. VT6105 [Rhine-III] (rev 8b) 0000:01:00.0 VGA compatible controller: nVidia Corporation NV11DDR [GeForce2 MX 100 DDR/200 DDR] (rev b2)
i also tryed make installCode:root@p4-1800:/temp/4.39# make make -C /lib/modules/2.6.12/build SUBDIRS=/temp/4.39 modules make[1]: Entering directory `/usr/src/linux-2.6.12' CC [M] /temp/4.39/rhine_main.o /temp/4.39/rhine_main.c: En la función `rhine_ethtool_ioctl': /temp/4.39/rhine_main.c:2751: error: structure has no member named `slot_name' /temp/4.39/rhine_main.c: En la función `rhine_suspend': /temp/4.39/rhine_main.c:2924: error: too many arguments to function `pci_save_state' /temp/4.39/rhine_main.c: En la función `rhine_resume': /temp/4.39/rhine_main.c:2958: error: too many arguments to function `pci_restore_state' make[2]: *** [/temp/4.39/rhine_main.o] Error 1 make[1]: *** [_module_/temp/4.39] Error 2 make[1]: Leaving directory `/usr/src/linux-2.6.12' make: *** [default] Error 2 root@p4-1800:/temp/4.39#
[/code]Code:root@p4-1800:/temp/4.39# make install make -C /lib/modules/2.6.12/build SUBDIRS=/temp/4.39 modules make[1]: Entering directory `/usr/src/linux-2.6.12' CC [M] /temp/4.39/rhine_main.o /temp/4.39/rhine_main.c: En la función `rhine_ethtool_ioctl': /temp/4.39/rhine_main.c:2751: error: structure has no member named `slot_name' /temp/4.39/rhine_main.c: En la función `rhine_suspend': /temp/4.39/rhine_main.c:2924: error: too many arguments to function `pci_save_state' /temp/4.39/rhine_main.c: En la función `rhine_resume': /temp/4.39/rhine_main.c:2958: error: too many arguments to function `pci_restore_state' make[2]: *** [/temp/4.39/rhine_main.o] Error 1 make[1]: *** [_module_/temp/4.39] Error 2 make[1]: Leaving directory `/usr/src/linux-2.6.12' make: *** [default] Error 2 root@p4-1800:/temp/4.39#
via rhine should be supported out of box in 99%of cases, no need to recompile

16GB KIT (2x8GB) DDR3 Gamer Desktop RAM PC3 MIXED BRANDS VIPER VENGEANCE FURY
$10.00
Netac DDR4 32GB 16GB DDR4 3200MHz UDIMM C16 Desktop Internal Memory RAM Kit
$99.99
Crucial 32GB(4 x 8GB) CT8G4DFS824A.C8FDD1 DDR4-2400 UDIMM Desktop RAM - CR352A
$89.95
Micron 16GB (2x8GB) 2Rx8 DDR3 1600MHz PC3-12800U Desktop RAM
$19.99
Samsung 32GB DDR4-2666V-2Rx4-RB2-12 RAM M393A4K40CB2-CTD6Q
$169.00
32GB 2Rx8 PC4 - 3200AA - SE1-13 (x2) 64GB
$280.00
Major Brand 16GB (2x8GB) PC3-12800U DDR3-1600MHz DDR3-12800 DESKTOP RAM NON-ECC
$29.99
RAMAXEL Lenovo 32GB LPDDR5X CAMM2 7500MHz Laptop RAM | UNTESTED
$445.00
Samsung 32GB DDR4-2666 PC4-21300 288-Pin DIMM RAM M393A4K40CB1CRC0Q
$185.00
Corsair Vengeance DDR3 8GB 16GB 32GB 1866MHz PC3-14900 Desktop RAM Memory DIMM
$85.00