-
GTK+-2.8.17 compilation Problem
hi respected all,
i got following make errors in gtk+-2.8.17.
there is no problem in configure.
/bin/sh ../libtool --mode=link gcc -g -O2 -Wall -L/home/zakariya/trend/lib -o gtk-query-immodules-2.0 queryimmodules.o libgtk-x11-2.0.la ../gdk-pixbuf/libgdk_pixbuf-2.0.la ../gdk/libgdk-x11-2.0.la
gcc -g -O2 -Wall -o .libs/gtk-query-immodules-2.0 queryimmodules.o -L/home/zakariya/trend/lib ./.libs/libgtk-x11-2.0.so /home/zakariya/PACKAGES/zakariya/gtk+-2.8.17/gdk/.libs/libgdk-x11-2.0.so -L/home/zakariya/trend/X11R6/lib /home/zakariya/trend/lib/libatk-1.0.so -L/usr//lib /usr//lib/libgobject-2.0.so /usr//lib/libgmodule-2.0.so /usr//lib/libglib-2.0.so ../gdk-pixbuf/.libs/libgdk_pixbuf-2.0.so ../gdk/.libs/libgdk-x11-2.0.so -lXrandr -lXinerama -lXext /home/zakariya/trend/lib/libpangocairo-1.0.so /home/zakariya/trend/lib/libpango-1.0.so /home/zakariya/trend/lib/libcairo.so -lXrender -lX11 /home/zakariya/trend/lib/libfontconfig.so /home/zakariya/trend/lib/libfreetype.so -lz /usr/lib/libexpat.so /home/zakariya/PACKAGES/zakariya/gtk+-2.8.17/gdk-pixbuf/.libs/libgdk_pixbuf-2.0.so /home/zakariya/trend/lib/libgmodule-2.0.so -ldl /home/zakariya/trend/lib/libgobject-2.0.so /home/zakariya/trend/lib/libglib-2.0.so -lm -Wl,--rpath -Wl,/usr//lib
./.libs/libgtk-x11-2.0.so: undefined reference to `g_intern_static_string'
/home/zakariya/trend/lib/libpango-1.0.so: undefined reference to `g_slice_free_chain_with_offset'
/home/zakariya/trend/lib/libpangocairo-1.0.so: undefined reference to `g_slice_alloc'
/home/zakariya/trend/lib/libpango-1.0.so: undefined reference to `g_slice_alloc0'
/home/zakariya/trend/lib/libpangocairo-1.0.so: undefined reference to `g_slice_free1'
collect2: ld returned 1 exit status
make[4]: *** [gtk-query-immodules-2.0] Error 1
make[4]: Leaving directory `/home/zakariya/PACKAGES/zakariya/gtk+-2.8.17/gtk'
make[3]: *** [all-recursive] Error 1
make[3]: Leaving directory `/home/zakariya/PACKAGES/zakariya/gtk+-2.8.17/gtk'
make[2]: *** [all] Error 2
make[2]: Leaving directory `/home/zakariya/PACKAGES/zakariya/gtk+-2.8.17/gtk'
make[1]: *** [all-recursive] Error 1
make[1]: Leaving directory `/home/zakariya/PACKAGES/zakariya/gtk+-2.8.17'
make: *** [all] Error 2
i need ur great help to fix this error.Please help me .i already compiled the following packages successfully.
glib 2.10.2
cairo 1.10.4
pango 1.12.2
freetype-2.1.10
fontconfig-2.3.95
given paths are: PKG_CONFIG_PATH=/home/zakariya/trend/lib/pkgconfig
LD_LIBRARY_PATH=/home/zakariya/trend/lib
Similar Threads
-
By pc3 in forum General Support
Replies: 1
Last Post: 08-03-2004, 10:44 PM
-
By bcalder in forum General Support
Replies: 5
Last Post: 03-15-2004, 09:42 PM
-
By knoppy in forum Hdd Install / Debian / Apt
Replies: 5
Last Post: 02-19-2004, 09:34 PM
-
By Li0nheart in forum General Support
Replies: 0
Last Post: 11-19-2003, 12:42 AM
-
By lucky in forum General Support
Replies: 5
Last Post: 05-19-2003, 11:19 AM
Posting Permissions
- You may not post new threads
- You may not post replies
- You may not post attachments
- You may not edit your posts
-
Forum Rules

Kingston 32GB 64GB 128GB 256GB USB 3.0 Flash Drive Thumb Memory Stick Pen lot
$285.90

2021 Full Version Office Professional Plus for 1 PC Flash USB Drive
$59.99

1/ 10/ 100pcs USB 2.0 2GB, 4GB ,8GB ,16GB ,32GB ,64GB 128GB USB Flash Drives Lot
$269.10

Microsoft Windows 11 Pro 64bit - New Sealed – Flash USB 1 PC
$49.99

USB 3.0 Flash Drive 32GB 64GB 128GB Memory Stick Thumb Stick Lot Pack
$826.09

USB Type-A Flash Drive Metal Memory Stick High Speed USB Drive 128GB 256GB 512GB
$8.47

Wholesale 5/10/100PCS 1GB 2GB 4GB 8GB 16GB 32GB USB 2.0 Flash Drive Memory Stick
$305.01

LOT 10x SanDisk 32GB ULTRA USB 3.0 flash drive SDCZ48-032G 32 GB read 100 MB/s
$39.80

Zero Trace Pen: All-in-one Tor Network Anonymous Drive + Cryptocurrency Wallet
$147.00

128GB USB 14-in-1 MacOS bootable Installer repair recovery tech support service
$39.99