-
g++ and knoppix
i've tried to install lactivemq-cpp libraries, but i get error:
Code:
checking for pthread_create in -lpthread... no configure: error: libpthread not found!
but lpthread.so is in a directory /usr/lib nevermind. i've tried to compile an example program in c++ and i get error:
Code:
g++: command not found
how to install g++ using apt-get? there is no "build-essential" (like in ubuntu) in repositories
-
Senior Member
registered user
Try using aptitude. You didn't say which version of knoppix you are using , but in 6.0.2 , followed by
Code:
apt-cache policy build-essential
will show that it is in indeed available.
Code:
aptitude install build-essential
will install it, you will have to reject it's first attemp and accept a downgrade of some other packages before it will install. Then you should be able use aptitude to install the libraries.
Good luck.
-

Originally Posted by
rusty
Try using aptitude. You didn't say which version of knoppix you are using , but in 6.0.2 ,
followed by
Code:
apt-cache policy build-essential
will show that it is in indeed available.
Code:
aptitude install build-essential
will install it, you will have to reject it's first attemp and accept a downgrade of some other packages before it will install. Then you should be able use aptitude to install the libraries.
Good luck.
thanks. it works.
but when i try to install lactivemqq-cpp, i have error:
Code:
/UNIONFS/usr/bin/../lib/gcc/../../include/c++/4.3/ext/new_allocator.h:108: error: no matching function for call to 'operator new(unsigned int, void*)' :0: note: candidates are: void* operator new(unsigned int) make[2]: *** [activemq/cmsutil/libactivemq_cpp_la-CmsAccessor.lo] Error 1 make[2]: Leaving directory `/home/knoppix/activemq-cpp-library-3.1.3/src/main' make[1]: *** [all-recursive] Error 1 make[1]: Leaving directory `/home/knoppix/activemq-cpp-library-3.1.3' make: *** [all] Error 2
what's wrong
-
Senior Member
registered user
Not sure, perhaps posting in one of the Activemq forums would yield an answer.
-
cpp.cpp: [code]#include using namespace std ; int main(int argc, char ** argv) { cout
Posting Permissions
- You may not post new threads
- You may not post replies
- You may not post attachments
- You may not edit your posts
-
Forum Rules

Dell 6P85J 4TB ST4000NM0063 7.2k 6Gb/s 3.5” SAS SED Hard Drive with Tray
$39.99

Western Digital HUS726T4TAL5204 4TB 7.2K SAS 12Gb/s 3.5" 512e HDD NetApp X375A
$64.00

Western Digital 1TB 3.5" SATA III 7200RPM Desktop Hard Drive
$34.99

(ST8000NM0045) SEAGATE ENTERPRISE 8TB 7200RPM 4Kn SATA 6Gb/s 3.5" HARD DRIVE
$199.99

HGST 0F23072 Deskstar NAS 6TB SATA III 7200RPM 128MB 3.5in HDD
$84.99

Western Digital WD Blue WD10EZEX 1 TB 3.5" SATA III Desktop Hard Drive
$23.99

Dell ST6000NM0034 1HT27Z-150 NWCCG 6TB SAS 3.5 7.2K ENTERPRISE SERVER DRIVE
$68.99

Seagate Exos ST2000NX0253 HDD 2TB SATA 7.2K 2.5" 512b/s
$55.00

DELL 2TB Enterprise HDD (7200RPM, 3.5", SATA III, 128MB Cache) HUS722T2TALA600
$49.95

Seagate ST12000NM0127 12TB 256MB 7200RPM 3.5" SATA 6.0Gb/s Enterprise Hard Drive
$318.99