-
g++ and knoppix
i've tried to install lactivemq-cpp libraries, but i get error:
Code:
checking for pthread_create in -lpthread... no configure: error: libpthread not found!
but lpthread.so is in a directory /usr/lib nevermind. i've tried to compile an example program in c++ and i get error:
Code:
g++: command not found
how to install g++ using apt-get? there is no "build-essential" (like in ubuntu) in repositories
-
Senior Member
registered user
Try using aptitude. You didn't say which version of knoppix you are using , but in 6.0.2 , followed by
Code:
apt-cache policy build-essential
will show that it is in indeed available.
Code:
aptitude install build-essential
will install it, you will have to reject it's first attemp and accept a downgrade of some other packages before it will install. Then you should be able use aptitude to install the libraries.
Good luck.
-

Originally Posted by
rusty
Try using aptitude. You didn't say which version of knoppix you are using , but in 6.0.2 ,
followed by
Code:
apt-cache policy build-essential
will show that it is in indeed available.
Code:
aptitude install build-essential
will install it, you will have to reject it's first attemp and accept a downgrade of some other packages before it will install. Then you should be able use aptitude to install the libraries.
Good luck.
thanks. it works.
but when i try to install lactivemqq-cpp, i have error:
Code:
/UNIONFS/usr/bin/../lib/gcc/../../include/c++/4.3/ext/new_allocator.h:108: error: no matching function for call to 'operator new(unsigned int, void*)' :0: note: candidates are: void* operator new(unsigned int) make[2]: *** [activemq/cmsutil/libactivemq_cpp_la-CmsAccessor.lo] Error 1 make[2]: Leaving directory `/home/knoppix/activemq-cpp-library-3.1.3/src/main' make[1]: *** [all-recursive] Error 1 make[1]: Leaving directory `/home/knoppix/activemq-cpp-library-3.1.3' make: *** [all] Error 2
what's wrong
-
Senior Member
registered user
Not sure, perhaps posting in one of the Activemq forums would yield an answer.
-
cpp.cpp: [code]#include using namespace std ; int main(int argc, char ** argv) { cout
Posting Permissions
- You may not post new threads
- You may not post replies
- You may not post attachments
- You may not edit your posts
-
Forum Rules

Acer Aspire 14" AI Copilot+PC Laptop Core Ultra 5 226V Gen 4 ARC 16GB 1TB Refurb
$475.21

External SSD 1TB 2TB Portable Hard Drive USB 3.1 Type-C High Speed PC Mac
$16.99

Dell Latitude 14" Laptop Computer Intel i7 Up To 32GB RAM 1TB SSD Windows 11 Pro
$465.98

NEW 2026 SGIN 18.5" Laptop Windows 11 PRO Intel N5095 16GB DDR4 1024GB SSD
$444.99

Acer Predator Helios Neo 16S AI 16" i9 275HX 2S RTX 5070 Ti 32GB 1TB SSD Refurb
$1794.16

Fanxiang 1/2/5/10Pcs 2.5'' SATA SSD Lot 1TB 2TB 4TB 512GB 256GB TLC Internal SSD
$129.99

Western Digital WD Blue WD10EZEX 1 TB 3.5" SATA III Desktop Hard Drive
$23.99

Apple iPad Pro 12.9" 5th Gen 128GB 256GB 1TB 2TB Wi-Fi Or Cellular - Good
$509.99

Dell Latitude 14" Laptop Computer Intel i5 Up To 32GB RAM 1TB SSD Windows 11 Pro
$545.25

SGIN 15.6" Laptop 16GB RAM 1TB SSD Win 11 Intel i3-10100Y Backlit Keyboard FHD
$335.99