DKMS make.log for ndiswrapper-1.58 for kernel 3.4.4 (i686)
Sat Dec 7 12:53:09 UTC 2013
make: Entering directory `/usr/src/linux-headers-3.4.4'
LD /var/lib/dkms/ndiswrapper/1.58/build/built-in.o
MKEXPORT /var/lib/dkms/ndiswrapper/1.58/build/crt_exports.h
MKEXPORT /var/lib/dkms/ndiswrapper/1.58/build/hal_exports.h
MKEXPORT /var/lib/dkms/ndiswrapper/1.58/build/ndis_exports.h
MKEXPORT /var/lib/dkms/ndiswrapper/1.58/build/ntoskernel_exports.h
MKEXPORT /var/lib/dkms/ndiswrapper/1.58/build/ntoskernel_io_exports.h
MKEXPORT /var/lib/dkms/ndiswrapper/1.58/build/rtl_exports.h
MKEXPORT /var/lib/dkms/ndiswrapper/1.58/build/usb_exports.h
CC [M] /var/lib/dkms/ndiswrapper/1.58/build/crt.o
CC [M] /var/lib/dkms/ndiswrapper/1.58/build/hal.o
CC [M] /var/lib/dkms/ndiswrapper/1.58/build/iw_ndis.o
CC [M] /var/lib/dkms/ndiswrapper/1.58/build/loader.o
CC [M] /var/lib/dkms/ndiswrapper/1.58/build/ndis.o
CC [M] /var/lib/dkms/ndiswrapper/1.58/build/ntoskernel.o
CC [M] /var/lib/dkms/ndiswrapper/1.58/build/ntoskernel_io.o
CC [M] /var/lib/dkms/ndiswrapper/1.58/build/pe_linker.o
CC [M] /var/lib/dkms/ndiswrapper/1.58/build/pnp.o
CC [M] /var/lib/dkms/ndiswrapper/1.58/build/proc.o
/var/lib/dkms/ndiswrapper/1.58/build/proc.c:35:47: error: unknown type name ‘kuid_t’
/var/lib/dkms/ndiswrapper/1.58/build/proc.c:35:59: error: unknown type name ‘kgid_t’
/var/lib/dkms/ndiswrapper/1.58/build/proc.c: In function ‘procfs_write_ndis_settings’:
/var/lib/dkms/ndiswrapper/1.58/build/proc.c:291:9: error: implicit declaration of function ‘file_inode’ [-Werror=implicit-function-declaration]
/var/lib/dkms/ndiswrapper/1.58/build/proc.c:291:9: warning: passing argument 1 of ‘PDE_DATA’ makes pointer from integer without a cast [enabled by default]
/var/lib/dkms/ndiswrapper/1.58/build/proc.c:30:21: note: expected ‘const struct inode *’ but argument is of type ‘int’
/var/lib/dkms/ndiswrapper/1.58/build/proc.c: In function ‘wrap_procfs_add_ndis_device’:
/var/lib/dkms/ndiswrapper/1.58/build/proc.c:420:2: error: implicit declaration of function ‘proc_set_user’ [-Werror=implicit-function-declaration]
cc1: some warnings being treated as errors
make[1]: *** [/var/lib/dkms/ndiswrapper/1.58/build/proc.o] Error 1
make: *** [_module_/var/lib/dkms/ndiswrapper/1.58/build] Error 2
make: Leaving directory `/usr/src/linux-headers-3.4.4'