-
Senior Member
registered user
Problem compiling kernel-source-2.4.20-xfs
When I get to make bzImage, I get the following errors.
make[4]: *** [tdfx_drv.o] Error 1
make[4]: Leaving directory `/usr/src/kernel-source-2.4.20-xfs/drivers/char/drm'
make[3]: *** [first_rule] Error 2
make[3]: Leaving directory `/usr/src/kernel-source-2.4.20-xfs/drivers/char/drm'
make[2]: *** [_subdir_drm] Error 2
make[2]: Leaving directory `/usr/src/kernel-source-2.4.20-xfs/drivers/char'
make[1]: *** [_subdir_char] Error 2
make[1]: Leaving directory `/usr/src/kernel-source-2.4.20-xfs/drivers'
make: *** [_dir_drivers] Error 2
Any help appreciated!
Similar Threads
-
By guyr in forum Hdd Install / Debian / Apt
Replies: 1
Last Post: 04-14-2004, 04:26 PM
-
By Nils_ in forum Hardware & Booting
Replies: 1
Last Post: 03-06-2004, 05:55 PM
-
By anhtran81 in forum Hdd Install / Debian / Apt
Replies: 5
Last Post: 01-18-2004, 06:06 AM
-
By Fang in forum Customising & Remastering
Replies: 8
Last Post: 12-01-2003, 05:54 PM
-
By Rivendell in forum General Support
Replies: 3
Last Post: 06-24-2003, 06:21 AM
Posting Permissions
- You may not post new threads
- You may not post replies
- You may not post attachments
- You may not edit your posts
-
Forum Rules

Western Digital HUS726T4TAL5204 4TB 7.2K SAS 12Gb/s 3.5" 512e HDD NetApp X375A
$64.00

Western Digital Purple 8TB Internal Desktop Surveillance Hard Drive (WD82PURZ)
$130.00

HGST Ultrastar HUS726040AL5210 4TB 7200RPM SAS 12Gb/s Enterprise HDD
$41.00

HDD 3.5" SATA Hard Drive with Windows 10/Win 11 64x Installed Legacy
$35.00

Dell ST6000NM0034 1HT27Z-150 NWCCG 6TB SAS 3.5 7.2K ENTERPRISE SERVER DRIVE
$68.99

Seagate Barracuda ST1000DM003 1 TB SATA III 3.5 in Desktop Hard Drive
$23.99

Toshiba MG03ACA400 4TB 7200 RPM SATA 6.0Gb/s 3.5" Enterprise HDD (V6313)
$61.56

Seagate ST3000NM0005 HDD 3TB SATA 6Gb/s 7.2K 3.5" 512 b/s
$59.00

Seagate ST8000NM0075 Enterprise Capacity 3.5 HDD 8TB SAS Hard Drive 8TB EXOS
$184.99

DELL 2TB Enterprise HDD (7200RPM, 3.5", SATA III, 128MB Cache) HUS722T2TALA600
$49.95