Results 1 to 2 of 2

Thread: errors while making modules

  1. #1
    Junior Member
    Join Date
    Jul 2003
    Posts
    1

    errors while making modules

    I try to build a new Kernel, everythink works fine on my system but im not able to make a new kernel. I read allready the Instruction here but always i do "make modules" i get following error :

    agpgart_be.c: In function `agp_generic_create_gatt_table':
    agpgart_be.c:591: warning: assignment from incompatible pointer type
    agpgart_be.c: In function `amd_create_gatt_table':
    agpgart_be.c:2476: warning: assignment from incompatible pointer type
    agpgart_be.c:2477: warning: assignment from incompatible pointer type
    agpgart_be.c: In function `amd_free_gatt_table':
    agpgart_be.c:2503: warning: assignment from incompatible pointer type
    agpgart_be.c:2504: warning: assignment from incompatible pointer type
    agpgart_be.c: In function `serverworks_create_gatt_table':
    agpgart_be.c:3587: warning: assignment from incompatible pointer type
    agpgart_be.c:3588: warning: assignment from incompatible pointer type
    agpgart_be.c: In function `serverworks_free_gatt_table':
    agpgart_be.c:3616: warning: assignment from incompatible pointer type
    agpgart_be.c:3617: warning: assignment from incompatible pointer type
    ld -m elf_i386 -r -o agpgart.o agpgart_fe.o agpgart_be.o
    make[3]: Leaving directory `/usr/src/kernel-source-2.4.20-xfs/drivers/char/agp'
    make -C drm modules
    make[3]: Entering directory `/usr/src/kernel-source-2.4.20-xfs/drivers/char/drm'
    gcc-2.95 -D__KERNEL__ -I/usr/src/kernel-source-2.4.20-xfs/include -Wall -Wstrict-prototypes -Wno-trigraphs -O2 -fno-strict-aliasing -fno-common -fomit-frame-pointer -pipe -mpreferred-stack-boundary=2 -march=i686 -DMODULE -nostdinc -iwithprefix include -DKBUILD_BASENAME=tdfx_drv -c -o tdfx_drv.o tdfx_drv.c
    In file included from tdfx_drv.c:35:
    drmP.h:932: redefinition of `__cmpxchg'
    /usr/src/kernel-source-2.4.20-xfs/include/asm/system.h:244: `__cmpxchg' previously defined here
    make[3]: *** [tdfx_drv.o] Fehler 1
    make[3]: Leaving directory `/usr/src/kernel-source-2.4.20-xfs/drivers/char/drm'
    make[2]: *** [_modsubdir_drm] Fehler 2
    make[2]: Leaving directory `/usr/src/kernel-source-2.4.20-xfs/drivers/char'
    make[1]: *** [_modsubdir_char] Fehler 2
    make[1]: Leaving directory `/usr/src/kernel-source-2.4.20-xfs/drivers'
    make: *** [_mod_drivers] Fehler 2

    I allready updated the System and changed the DRI drivers, so i dont want to reinstall to try if it works on a fresh install.

    please help

  2. #2
    Junior Member
    Join Date
    Aug 2003
    Posts
    1
    I got the exact same thing after building Free S/Wan for the 2.4.20-xfs kernel with "make oldgo" in the Fre S/Wan source directory. The only other modification I made to the kernel configuration was the definition of the correct processor. Did you managed to get i build properly?

    many thanks
    gronk

Similar Threads

  1. Can't open dependencies file /lib/modules/extra/modules.dep
    By wicking in forum Hdd Install / Debian / Apt
    Replies: 0
    Last Post: 08-06-2004, 07:50 PM
  2. modules in /etc/modules not loading
    By gus in forum Customising & Remastering
    Replies: 0
    Last Post: 07-22-2004, 09:52 AM
  3. Many Errors at .xsession-errors file ...
    By mikekgr in forum Hdd Install / Debian / Apt
    Replies: 0
    Last Post: 06-30-2004, 08:01 AM
  4. Making modules persistant at boot -STILL OPEN
    By gowator in forum Hdd Install / Debian / Apt
    Replies: 8
    Last Post: 02-06-2004, 01:51 PM
  5. Modules.conf more recent the modules.dep
    By Ambrose in forum Customising & Remastering
    Replies: 3
    Last Post: 08-12-2003, 05:01 PM

Posting Permissions

  • You may not post new threads
  • You may not post replies
  • You may not post attachments
  • You may not edit your posts
  •  


Lenovo ThinkPad L13 Yoga Touch Laptop 13.3” Core i5 8GB RAM 256GB SSD Win 11 Pro picture

Lenovo ThinkPad L13 Yoga Touch Laptop 13.3” Core i5 8GB RAM 256GB SSD Win 11 Pro

$239.99



Lenovo ThinkPad L15 Gen 3 15.6

Lenovo ThinkPad L15 Gen 3 15.6" 16GB, Thunder Black

$241.50



Lenovo ThinkPad T14 Gen 2 i5-1145G7 16GB 512GB SSD Touch Win 11 Pro Good picture

Lenovo ThinkPad T14 Gen 2 i5-1145G7 16GB 512GB SSD Touch Win 11 Pro Good

$261.99



Lenovo ThinkPad L15 Gen 3 15.6

Lenovo ThinkPad L15 Gen 3 15.6" 16GB, Thunder Black

$241.50



Lenovo ThinkPad E14 Gen 2 Laptop 14” HD Ryzen 5 16GB RAM 512GB SSD Win 11 Pro picture

Lenovo ThinkPad E14 Gen 2 Laptop 14” HD Ryzen 5 16GB RAM 512GB SSD Win 11 Pro

$319.99



Lenovo - IdeaPad Slim 3i 15.3

Lenovo - IdeaPad Slim 3i 15.3" 2K Touchscreen Laptop - Intel Core 7 350 2026 ...

$679.99



Lenovo ThinkPad T480s | i5-8350U | 256GB NVMe | 8GB RAM | W11 Pro | W/AC Adapter picture

Lenovo ThinkPad T480s | i5-8350U | 256GB NVMe | 8GB RAM | W11 Pro | W/AC Adapter

$169.99



Lenovo ThinkPad E14 Gen 3 Laptop 14” FHD AMD Ryzen 5 16GB RAM 512GB SSD Win 11 picture

Lenovo ThinkPad E14 Gen 3 Laptop 14” FHD AMD Ryzen 5 16GB RAM 512GB SSD Win 11

$374.99



Windows 11 PRO Laptop Notebook PC Computer, 8GB Ram, Webcam, Wifi, and HDMI picture

Windows 11 PRO Laptop Notebook PC Computer, 8GB Ram, Webcam, Wifi, and HDMI

$144.00



Lenovo ThinkPad T14s Laptop 14” Laptop Core i5 8GB RAM 256GB SSD Windows 11 Pro picture

Lenovo ThinkPad T14s Laptop 14” Laptop Core i5 8GB RAM 256GB SSD Windows 11 Pro

$249.99