Results 1 to 2 of 2

Thread: Upgraded Kernel Won't Compile

  1. #1
    Junior Member
    Join Date
    Nov 2003
    Location
    NJ, USA
    Posts
    18

    Upgraded Kernel Won't Compile

    I am a newbie dual booting Windows & Linux (from Knoppix) & trying
    to upgrade my kernel from 2.4.22-xfs to 2.4.25 or 2.6.3 but the new
    kernel won't compile. It seems to work OK for awhile but then it ends
    with an error. I have tried many times & I get slightly different errors
    each time (usually "internal compiler error: Segmentation fault"). It
    did work once but the kernel wouldn't boot (framebuffer console, VESA
    & VGA16 options were not enabled). This is how 2 recent attempts ended:

    Code:
    In file included from include/linux/gfp.h:4,
                     from include/linux/slab.h:15,
                     from include/linux/percpu.h:4,
                     from include/linux/sched.h:31,
                     from include/linux/module.h:10,
                     from fs/nls/nls_cp852.c:10:
    include/linux/mmzone.h:338: internal compiler error: Segmentation fault
    Please submit a full bug report,
    with preprocessed source if appropriate.
    See <URL:http://gcc.gnu.org/bugs.html> for instructions.
    make[3]: *** [fs/nls/nls_cp852.o] Error 1
    make[2]: *** [fs/nls] Error 2
    make[1]: *** [fs] Error 2
    make[1]: Leaving directory `/usr/src/linux-2.6.3'
    make: *** [stamp-build] Error 2
    Code:
    In file included from include/linux/device.h:22,
                     from include/linux/genhd.h:15,
                     from include/linux/blkdev.h:6,
                     from fs/hfs/super.c:31:
    include/linux/pm.h:239: internal compiler error: Illegal instruction
    Please submit a full bug report,
    with preprocessed source if appropriate.
    See <URL:http://gcc.gnu.org/bugs.html> for instructions.
    make[3]: *** [fs/hfs/super.o] Error 1
    make[2]: *** [fs/hfs] Error 2
    make[1]: *** [fs] Error 2
    make[1]: Leaving directory `/usr/src/linux-2.6.3'
    make: *** [stamp-build] Error 2
    I tried downgrading gcc from 3.3.3 to 2.95-4 but that didn't work either.
    I couldn't find a package for 2.95-3 & I couldn't compile the 2.95-3
    source. I was able to compile 2.6.3 using the Knoppix live CD but it
    took an extremely long time & now I don't have sound, mouse scroll wheel
    or usb support so I have to do it over again. Is there anything I can
    do about this?
    Max

  2. #2
    Junior Member
    Join Date
    Nov 2003
    Location
    NJ, USA
    Posts
    18
    Well, I didn't get any replies to my question so after trying to install a precompiled kernel (kernel-image-2.6-386) which wouldn't boot I went to
    http://developer.linuxtag.net/knoppix/i386/ & downloaded the file
    kernel-image-2.4.23-xfs_10.00.Custom_i386.deb which installed & booted
    OK. So I've upgraded my kernel slightly, sound works, the mouse scroll wheel works again & my externel usb drive will mount. I guess I'll just have to wait for kernel-image-2.6.3-xfs_10.00.Custom_i386.deb to show up.
    Max

Similar Threads

  1. How do I install kernel source and config/compile kernel??
    By cfish in forum Hdd Install / Debian / Apt
    Replies: 0
    Last Post: 04-25-2005, 07:31 AM
  2. How to compile the kernel ?
    By davidwahlstedt in forum Customising & Remastering
    Replies: 0
    Last Post: 03-17-2005, 05:42 PM
  3. Problems installing 2.6.x kernel on upgraded systems
    By Durand Hicks in forum General Support
    Replies: 0
    Last Post: 03-25-2004, 10:45 PM
  4. Kernel compile problem - first Knoppix kernel compile
    By Nigel_Tufnel in forum Hdd Install / Debian / Apt
    Replies: 2
    Last Post: 10-20-2003, 01:09 PM
  5. how to compile kernel ?
    By nhoxanh in forum General Support
    Replies: 0
    Last Post: 07-28-2003, 04:23 AM

Posting Permissions

  • You may not post new threads
  • You may not post replies
  • You may not post attachments
  • You may not edit your posts
  •  


Dell Precision T5820 Workstation 3.70GHz W-2135 No RAM/ GPU/ HDD/ OS picture

Dell Precision T5820 Workstation 3.70GHz W-2135 No RAM/ GPU/ HDD/ OS

$179.98



Dell Precision Tower 7810 Xeon E5-2630 v3 @ 2.40GHz , 32GB Ram, NO HDD, NO OS picture

Dell Precision Tower 7810 Xeon E5-2630 v3 @ 2.40GHz , 32GB Ram, NO HDD, NO OS

$239.99



Dell EMC PowerEdge R440 Xeon silver 4215 2.5GHz 16 GB ram  2x 550W PSU No HDD picture

Dell EMC PowerEdge R440 Xeon silver 4215 2.5GHz 16 GB ram 2x 550W PSU No HDD

$275.00



Dell PowerEdge FX2s + 8x FC430 Blades 16x E5-2630v4 160 Cores Rails No PSU/RAM picture

Dell PowerEdge FX2s + 8x FC430 Blades 16x E5-2630v4 160 Cores Rails No PSU/RAM

$699.00



Intel Xeon E5-2699 V4 2.20GHz 55M 22-CORES LGA2011-3 Server Processor 145W SR2JS picture

Intel Xeon E5-2699 V4 2.20GHz 55M 22-CORES LGA2011-3 Server Processor 145W SR2JS

$84.49



Dell Precision T7820 2x Xeon Silver 4114 2.20GHz 950W No RAM GPU HDD 4x SATA picture

Dell Precision T7820 2x Xeon Silver 4114 2.20GHz 950W No RAM GPU HDD 4x SATA

$350.48



Intel Xeon W-2255 SRGV8 3.7GHz 10-Core LGA2066 Server CPU Processor picture

Intel Xeon W-2255 SRGV8 3.7GHz 10-Core LGA2066 Server CPU Processor

$249.99



Genuine Intel Xeon W-2145 3.70Ghz  8 Cores LGA2066 CPU SR3LQ Tested USA SELLER  picture

Genuine Intel Xeon W-2145 3.70Ghz 8 Cores LGA2066 CPU SR3LQ Tested USA SELLER

$94.94



Apple Mac Pro 5,1 • 8‑Core 2.26GHz • 14GB RAM • 128GB SSD + 1TB HDD Dual NVIDIA picture

Apple Mac Pro 5,1 • 8‑Core 2.26GHz • 14GB RAM • 128GB SSD + 1TB HDD Dual NVIDIA

$325.00



Dell PowerEdge R530 2x E5-2630v4 H330 iDRAC8 Port Card Riser No PSU/RAM/HDD picture

Dell PowerEdge R530 2x E5-2630v4 H330 iDRAC8 Port Card Riser No PSU/RAM/HDD

$99.99