-
compiling cloop on fedora core 2
I am using fedora core 2 and I have tried to compile cloop version 2.01-5. However the default tarball gives me the following errors:
[root@skibum cloop-2.01]# make
( make -C advancecomp-1.9_create_compressed_fs advfs )
make[1]: Entering directory `/home/savarese/cloop-2.01/advancecomp-1.9_create_co
mpressed_fs'
g++ -DHAVE_CONFIG_H -I. -I. -I. -g -O3 -DUSE_ERROR_SILENT -DUSE_COMPRESS -c
-o advfs.o `test -f 'advfs.cc' || echo './'`advfs.cc
In file included from advfs.cc:24:
/usr/include/asm/byteorder.h:6:2: warning: #warning using private kernel header;
include <endian.h> instead!
In file included from advfs.cc:33:
/usr/include/netinet/in.h:262: error: syntax error before `)' token
/usr/include/netinet/in.h:262: error: syntax error before `?' token
/usr/include/netinet/in.h:262: error: syntax error before `)' token
/usr/include/netinet/in.h:263: error: syntax error before `)' token
/usr/include/netinet/in.h:263: error: syntax error before `?' token
/usr/include/netinet/in.h:263: error: syntax error before `)' token
/usr/include/netinet/in.h:265: error: syntax error before `)' token
/usr/include/netinet/in.h:265: error: syntax error before `?' token
/usr/include/netinet/in.h:265: error: syntax error before `)' token
/usr/include/netinet/in.h:267: error: syntax error before `)' token
/usr/include/netinet/in.h:267: error: syntax error before `?' token
/usr/include/netinet/in.h:267: error: syntax error before `)' token
In file included from advfs.cc:33:
/usr/include/netinet/in.h:387: error: syntax error before `}' token
make[1]: *** [advfs.o] Error 1
make[1]: Leaving directory `/home/savarese/cloop-2.01/advancecomp-1.9_create_com
pressed_fs'
make: *** [advancecomp-1.9_create_compressed_fs/advfs] Error 2
When I remove the byteorder include from advfs.cc and replace it with endian.h, I get this error:
[root@skibum cloop-2.01]# make
( make -C advancecomp-1.9_create_compressed_fs advfs )
make[1]: Entering directory `/home/savarese/cloop-2.01/advancecomp-1.9_create_compressed_fs'
g++ -DHAVE_CONFIG_H -I. -I. -I. -g -O3 -DUSE_ERROR_SILENT -DUSE_COMPRESS -c -o advfs.o `test -f 'advfs.cc' || echo './'`advfs.cc
advfs.cc: In function `int main(int, char**)':
advfs.cc:245: error: `__cpu_to_be64' undeclared (first use this function)
advfs.cc:245: error: (Each undeclared identifier is reported only once for each
function it appears in.)
make[1]: *** [advfs.o] Error 1
make[1]: Leaving directory `/home/savarese/cloop-2.01/advancecomp-1.9_create_compressed_fs'
make: *** [advancecomp-1.9_create_compressed_fs/advfs] Error 2
My kernel version is 2.6.8-1.521smp. Does anybody knows why this happens?
Thanks,
Scott
Similar Threads
-
By universpace in forum Klik
Replies: 3
Last Post: 03-11-2006, 08:52 AM
-
By shadyaftermath in forum MS Windows & New to Linux
Replies: 1
Last Post: 08-26-2005, 11:12 PM
-
By realpc in forum The Lounge
Replies: 0
Last Post: 07-26-2005, 09:27 PM
-
By ghstridr in forum Customising & Remastering
Replies: 5
Last Post: 05-04-2004, 11:15 AM
-
By pr0gm4 in forum Customising & Remastering
Replies: 0
Last Post: 08-27-2003, 02:31 PM
Posting Permissions
- You may not post new threads
- You may not post replies
- You may not post attachments
- You may not edit your posts
-
Forum Rules

2-Bay/4-Bay Hard Drive Enclosure for 3.5"/2.5'' SATA HDD/SSD 10Gbps USB-C 3.2
$75.99

OWC Mercury Elite Pro 2 Bay RAID Enclosure with USB 3.2 for Dual 3.5 inch HDDs
$87.99

Broadcom 9600-24i RAID Controller PCIe Gen 4.1 Tri-Mode NEW 05-50111-01004
$649.99

Intel VROC Premium RAID Controller Card PCIe Add-On Module VROCPREMMOD
$265.00

Acasis USB 3.2 2 Bay HDD RAID Enclosure for 2.5/3.5" SATA Drives External Array
$55.00

WAVLINK RAID 2 Bay Hard Drive Docking Station SATA 2.5/3.5'' SSD HDD Enclosure
$119.99

Dell PowerEdge HBA330 LP PCI-E 12GBs RAID SAS Controller Adapter J7TNV
$18.95

NVME M.2 Adapter Card PCIE X16 Splitter Expansion Controller 4-Disk Soft RAID
$24.43

Areca ARC-1882IX-24 (16i4e)24-Port RAID Controller Card w/BBU /HDD Monitor Board
$300.00

CalDigit VR minin 2 Portable Raid Storage On The Go
$75.00