Results 1 to 10 of 13

Thread: Repo ERROR w/SPM

Hybrid View

  1. #1
    Senior Member registered user
    Join Date
    Feb 2010
    Posts
    512
    Consult /var/lib/dkms/ndiswrapper/1.57/build/make.log for more information.
    What does this file say?

    I would suggest that you download and install ndiswrapper from the testing branch.
    ndiswrapper-utils-1.9_1.58-2_i386.deb, ndiswrapper-dkms_1.58-2_all.deb, ndiswrapper-common_1.58-2_all.deb

    I think you should try drivers made for Windows 2000 or XP.

  2. #2
    Senior Member
    Join Date
    Feb 2012
    Posts
    146

    Location of preloaded WiFi driver

    Quote Originally Posted by klaus2008 View Post

    I think you should try drivers made for Windows 2000 or XP.
    Hi,

    link

    This particular notebook came with the Broadcom b43 XP driver installed, NO CD!

    Q: Is there a way to hunt down the .INF driver file[s], used by ndiswrapper?

    luther

  3. #3
    Senior Member
    Join Date
    Feb 2012
    Posts
    146

    make log

    Consult /var/lib/dkms/ndiswrapper/1.57/build/make.log for more information.

    Quote Originally Posted by klaus2008 View Post
    What does this file say?
    Hi klaus2008,

    Here is the make log dialog:

    DKMS make.log for ndiswrapper-1.57 for kernel 3.4.4 (i686)
    Fri Dec 6 17:43:45 UTC 2013
    make: Entering directory `/usr/src/linux-headers-3.4.4'
    LD /var/lib/dkms/ndiswrapper/1.57/build/built-in.o
    MKEXPORT /var/lib/dkms/ndiswrapper/1.57/build/crt_exports.h
    MKEXPORT /var/lib/dkms/ndiswrapper/1.57/build/hal_exports.h
    MKEXPORT /var/lib/dkms/ndiswrapper/1.57/build/ndis_exports.h
    MKEXPORT /var/lib/dkms/ndiswrapper/1.57/build/ntoskernel_exports.h
    MKEXPORT /var/lib/dkms/ndiswrapper/1.57/build/ntoskernel_io_exports.h
    MKEXPORT /var/lib/dkms/ndiswrapper/1.57/build/rtl_exports.h
    MKEXPORT /var/lib/dkms/ndiswrapper/1.57/build/usb_exports.h
    CC [M] /var/lib/dkms/ndiswrapper/1.57/build/crt.o
    CC [M] /var/lib/dkms/ndiswrapper/1.57/build/hal.o
    CC [M] /var/lib/dkms/ndiswrapper/1.57/build/iw_ndis.o
    CC [M] /var/lib/dkms/ndiswrapper/1.57/build/loader.o
    CC [M] /var/lib/dkms/ndiswrapper/1.57/build/ndis.o
    /var/lib/dkms/ndiswrapper/1.57/build/ndis.c: In function 'NdisGetCurrentProcessorCounts':
    /var/lib/dkms/ndiswrapper/1.57/build/ndis.c:2657:24: error: 'struct kernel_stat' has no member named 'cpustat'
    /var/lib/dkms/ndiswrapper/1.57/build/ndis.c:2658:31: error: 'struct kernel_stat' has no member named 'cpustat'
    /var/lib/dkms/ndiswrapper/1.57/build/ndis.c:2659:17: error: 'struct kernel_stat' has no member named 'cpustat'
    make[1]: *** [/var/lib/dkms/ndiswrapper/1.57/build/ndis.o] Error 1
    make: *** [_module_/var/lib/dkms/ndiswrapper/1.57/build] Error 2
    make: Leaving directory `/usr/src/linux-headers-3.4.4'
    HTH
    luther

  4. #4
    Senior Member
    Join Date
    Feb 2012
    Posts
    146

    Question 1.58 'testing' make.log

    Quote Originally Posted by luther View Post
    Consult /var/lib/dkms/ndiswrapper/1.57/build/make.log for more information.
    Hi,

    DKMS make.log for ndiswrapper-1.58 for kernel 3.4.4 (i686)
    Sat Dec 7 12:53:09 UTC 2013
    make: Entering directory `/usr/src/linux-headers-3.4.4'
    LD /var/lib/dkms/ndiswrapper/1.58/build/built-in.o
    MKEXPORT /var/lib/dkms/ndiswrapper/1.58/build/crt_exports.h
    MKEXPORT /var/lib/dkms/ndiswrapper/1.58/build/hal_exports.h
    MKEXPORT /var/lib/dkms/ndiswrapper/1.58/build/ndis_exports.h
    MKEXPORT /var/lib/dkms/ndiswrapper/1.58/build/ntoskernel_exports.h
    MKEXPORT /var/lib/dkms/ndiswrapper/1.58/build/ntoskernel_io_exports.h
    MKEXPORT /var/lib/dkms/ndiswrapper/1.58/build/rtl_exports.h
    MKEXPORT /var/lib/dkms/ndiswrapper/1.58/build/usb_exports.h
    CC [M] /var/lib/dkms/ndiswrapper/1.58/build/crt.o
    CC [M] /var/lib/dkms/ndiswrapper/1.58/build/hal.o
    CC [M] /var/lib/dkms/ndiswrapper/1.58/build/iw_ndis.o
    CC [M] /var/lib/dkms/ndiswrapper/1.58/build/loader.o
    CC [M] /var/lib/dkms/ndiswrapper/1.58/build/ndis.o
    CC [M] /var/lib/dkms/ndiswrapper/1.58/build/ntoskernel.o
    CC [M] /var/lib/dkms/ndiswrapper/1.58/build/ntoskernel_io.o
    CC [M] /var/lib/dkms/ndiswrapper/1.58/build/pe_linker.o
    CC [M] /var/lib/dkms/ndiswrapper/1.58/build/pnp.o
    CC [M] /var/lib/dkms/ndiswrapper/1.58/build/proc.o
    /var/lib/dkms/ndiswrapper/1.58/build/proc.c:35:47: error: unknown type name ‘kuid_t’
    /var/lib/dkms/ndiswrapper/1.58/build/proc.c:35:59: error: unknown type name ‘kgid_t’
    /var/lib/dkms/ndiswrapper/1.58/build/proc.c: In function ‘procfs_write_ndis_settings’:
    /var/lib/dkms/ndiswrapper/1.58/build/proc.c:291:9: error: implicit declaration of function ‘file_inode’ [-Werror=implicit-function-declaration]
    /var/lib/dkms/ndiswrapper/1.58/build/proc.c:291:9: warning: passing argument 1 of ‘PDE_DATA’ makes pointer from integer without a cast [enabled by default]
    /var/lib/dkms/ndiswrapper/1.58/build/proc.c:30:21: note: expected ‘const struct inode *’ but argument is of type ‘int’
    /var/lib/dkms/ndiswrapper/1.58/build/proc.c: In function ‘wrap_procfs_add_ndis_device’:
    /var/lib/dkms/ndiswrapper/1.58/build/proc.c:420:2: error: implicit declaration of function ‘proc_set_user’ [-Werror=implicit-function-declaration]
    cc1: some warnings being treated as errors
    make[1]: *** [/var/lib/dkms/ndiswrapper/1.58/build/proc.o] Error 1
    make: *** [_module_/var/lib/dkms/ndiswrapper/1.58/build] Error 2
    make: Leaving directory `/usr/src/linux-headers-3.4.4'

    Which fork leads OUT?
    luther

Posting Permissions

  • You may not post new threads
  • You may not post replies
  • You may not post attachments
  • You may not edit your posts
  •  


DEC PDP-11/34 Front Panel Complete PDP11 RARE picture

DEC PDP-11/34 Front Panel Complete PDP11 RARE

$450.00



Vintage Intel Mainframe Server MCM CPU Substrate Lot Prototyping PGA Validation picture

Vintage Intel Mainframe Server MCM CPU Substrate Lot Prototyping PGA Validation

$500.00



HP 13210-60001 Disc Drive Interface PCB HP 7900A 7901A Vintage picture

HP 13210-60001 Disc Drive Interface PCB HP 7900A 7901A Vintage

$225.61



HP 5060-8359 8K Semiconductor Memory Module 5080-9747 Vintage HP Computer picture

HP 5060-8359 8K Semiconductor Memory Module 5080-9747 Vintage HP Computer

$224.72



Vtg IBM Mainframe Prototype Chip Module Lot 146 pc 1988-1993 ES/9000 Lab Arcive picture

Vtg IBM Mainframe Prototype Chip Module Lot 146 pc 1988-1993 ES/9000 Lab Arcive

$649.00



Commodore 64 PC with Model 1541 Diskette Drive and Flight Simulator II *READ* picture

Commodore 64 PC with Model 1541 Diskette Drive and Flight Simulator II *READ*

$199.99



Vintage Mainframe Computer Disk Drive Pack Dyson SMD 5 Level Disks picture

Vintage Mainframe Computer Disk Drive Pack Dyson SMD 5 Level Disks

$79.00



Rare Vintage Mainframe Burroughs Discrete-Transistor Cordwood Module B2500/B5000 picture

Rare Vintage Mainframe Burroughs Discrete-Transistor Cordwood Module B2500/B5000

$99.95



Vintage Telex 952003-112 Mechanical Terminal Keyboard IBM 3270 Mainframe DB25 picture

Vintage Telex 952003-112 Mechanical Terminal Keyboard IBM 3270 Mainframe DB25

$799.00



Vintage UNIVAC 3620670-01 Mainframe Logic Board 15MHz Sperry Computer PCB picture

Vintage UNIVAC 3620670-01 Mainframe Logic Board 15MHz Sperry Computer PCB

$98.95